{"text_format":"1","workbook":"xlsx","n_sheets":8,"sheets":["Erläuterung","1 - Strom und Erdgas 2021","2 - Strom und Erdgas 2022","3 - Treibstoff und Zuschuss","Import","Zählpunkte Schritt 1","Zählpunkte Schritt 2","Liste"],"not_rendered":{"charts":0,"images":5,"macros":1,"external_links":1,"defined_names":8,"comments":0,"pivot_tables":0},"unopened":[],"bounds":{"document_bytes":16777216,"sheet_cells":100000,"rows_first":2000,"rows_last":500,"rows_between":2000,"halvings":0,"cell_chars":16384,"cell_head_chars":4096},"cells_cut":0,"cells_raw":0,"read":"whole","date_system":"1900"}

{"sheet":"Erläuterung","index":0,"n_rows":0,"n_cols":0,"rows_kept":0,"cut":false,"hidden":false,"merged":[]}

{"sheet":"1 - Strom und Erdgas 2021","index":1,"n_rows":46,"n_cols":27,"rows_kept":46,"cut":false,"hidden":false,"merged":[[8,4,8,7]]}
[]
[null,"Energiekostenzuschuss"]
[null,"In drei Schritten zur Berechnung Ihres möglichen Zuschusses in der Basisstufe (für Unternehmen mit Energie-, Strom- und Treibstoffbeschaffungskosten bis EUR 16 Mio.)"]
[null,"Version ","1.4"]
[]
[null,"Bitte befüllen Sie ausschließlich die blau umrandeten Eingabefelder!"]
[]
[]
[null,"Ihre firmeninterne Referenz",null,null,null,null,null,null,"i","Firmenwortlaut, internes Aktenkennzeichen, o.ä."]
[]
[]
[null,"Schritt 1: Berechnung des Durchschnittsarbeitspreises in der Vergleichsperiode 2021"]
[]
[null,"Um die Preissteigerungen berechnen zu können, benötigen wir im ersten Schritt Angaben aus der letzten Jahresabrechnung Ihres Strom- und Erdgaslieferanten oder aus Ihrem Lastprofilzähler (sofern bei Ihnen ein Lastprofilzähler installiert wurde)."]
[null,"Mehrere Zählpunkte mit identem Tarif können mit einer fiktiven Zählpunktnummer zusammengefasst werden (beispielsweise 1111 für Strom und 2222 für Erdgas)."]
[]
[]
[null,"Zählpunkt"]
[null,"Zählpunktnummer (nur die letzten vier Stellen)",null,null,null,null,null,null,null,"i","Die Zählpunktnummer beginnt mit AT und kann der Abrechnung entnommen werden. Bitte geben Sie nur die letzten vier Stellen Ihrer Zählpunktnummer an.",null,null,null,null,null,null,null,null,null,null,null,null,{"$f":"H20","v":"Nein"},{"$f":"H21","v":0},{"$f":"H22","v":0},{"$f":"H23","v":0}]
[null,"Lastprofilzähler oder genormtes intelligentes Messgerät verfügbar",null,null,null,null,null,"Nein",null,"i","Ist ein Lastprofilzähler (Messgerät für Großkunden) oder ein genormtes intelligentes Messgerät mit monatlicher Abrechnung verfügbar, erfolgt die Zuschussberechnung gem. Pkt. 9.1.1 der Richtlinie."]
[null,"Energieart",null,null,null,null,null,null,null,"i","Bitte geben Sie die jeweilige Energieart an."]
[null,{"$f":"IF(H21=\"Erdgas\",\"Nettorechnungsbetrag (Erdgas)\",\"Nettorechnungsbetrag (Strom)\")","v":"Nettorechnungsbetrag (Strom)"},null,null,null,null,null,null,"EUR","i",{"$f":"IF(H21=\"Erdgas\",\"Der Nettorechnungsbetrag bezeichnet die Kosten für die verbrauchten Kilowattstunden (kWh) Erdgas (exkl. Steuern, Abgaben, Netzentgelte, etc.).\",\"Der Nettorechnungsbetrag bezeichnet die Kosten für die verbrauchten Kilowattstunden (kWh) Strom (exkl. Steuern, Abgaben, Netzentgelte, etc.).\")","v":"Der Nettorechnungsbetrag bezeichnet die Kosten für die verbrauchten Kilowattstunden (kWh) Strom (exkl. Steuern, Abgaben, Netzentgelte, etc.)."}]
[null,{"$f":"IF(H20=\"Nein\",IF(H21=\"Erdgas\",\"Erdgasverbrauch in kWh gem. letzter Jahresabrechnung\",\"Stromverbrauch in kWh gem. letzter Jahresabrechnung\"),IF(H21=\"Erdgas\",\"Erdgasverbrauch in kWh im Kalenderjahr 2021\",\"Stromverbrauch in kWh im Kalenderjahr 2021\"))","v":"Stromverbrauch in kWh gem. letzter Jahresabrechnung"},null,null,null,null,null,null,"kWh","i",{"$f":"IF(H20=\"Nein\",IF(H21=\"Erdgas\",\"Den Erdgasverbrauch entnehmen Sie bitte der letzten Jahresabrechnung, deren Abrechnungszeitraum zwischen 31. Jänner 2021 und 31. Jänner 2022 endet.\",\"Den Stromverbrauch entnehmen Sie bitte der letzten Jahresabrechnung, deren Abrechnungszeitraum zwischen 31. Jänner 2021 und 31. Jänner 2022 endet.\"),IF(H21=\"Erdgas\",\"Bitte geben Sie den Erdgasverbrauch für den gesamten Zeitraum von 1. Jänner 2021 und 31. Dezember 2021 an.\",\"Bitte geben Sie den Stromverbrauch für den gesamten Zeitraum von 1. Jänner 2021 und 31. Dezember 2021 an.\"))","v":"Den Stromverbrauch entnehmen Sie bitte der letzten Jahresabrechnung, deren Abrechnungszeitraum zwischen 31. Jänner 2021 und 31. Jänner 2022 endet."}]
[]
[null,"Zählpunkt"]
[null,"Zählpunktnummer (nur die letzten vier Stellen)",null,null,null,null,null,null,null,"i","Die Zählpunktnummer beginnt mit AT und kann der Abrechnung entnommen werden. Bitte geben Sie nur die letzten vier Stellen Ihrer Zählpunktnummer an.",null,null,null,null,null,null,null,null,null,null,null,null,{"$f":"H27","v":"Nein"},{"$f":"H28","v":0},{"$f":"H29","v":0},{"$f":"H30","v":0}]
[null,"Lastprofilzähler oder genormtes intelligentes Messgerät verfügbar",null,null,null,null,null,"Nein",null,"i","Ist ein Lastprofilzähler (Messgerät für Großkunden) oder ein genormtes intelligentes Messgerät mit monatlicher Abrechnung verfügbar, erfolgt die Zuschussberechnung gem. Pkt. 9.1.1 der Richtlinie."]
[null,"Energieart",null,null,null,null,null,null,null,"i","Bitte geben Sie die jeweilige Energieart an."]
[null,{"$f":"IF(H28=\"Erdgas\",\"Nettorechnungsbetrag (Erdgas)\",\"Nettorechnungsbetrag (Strom)\")","v":"Nettorechnungsbetrag (Strom)"},null,null,null,null,null,null,"EUR","i",{"$f":"IF(H28=\"Erdgas\",\"Der Nettorechnungsbetrag bezeichnet die Kosten für die verbrauchten Kilowattstunden (kWh) Erdgas (exkl. Steuern, Abgaben, Netzentgelte, etc.).\",\"Der Nettorechnungsbetrag bezeichnet die Kosten für die verbrauchten Kilowattstunden (kWh) Strom (exkl. Steuern, Abgaben, Netzentgelte, etc.).\")","v":"Der Nettorechnungsbetrag bezeichnet die Kosten für die verbrauchten Kilowattstunden (kWh) Strom (exkl. Steuern, Abgaben, Netzentgelte, etc.)."}]
[null,{"$f":"IF(H27=\"Nein\",IF(H28=\"Erdgas\",\"Erdgasverbrauch in kWh gem. letzter Jahresabrechnung\",\"Stromverbrauch in kWh gem. letzter Jahresabrechnung\"),IF(H28=\"Erdgas\",\"Erdgasverbrauch in kWh im Kalenderjahr 2021\",\"Stromverbrauch in kWh im Kalenderjahr 2021\"))","v":"Stromverbrauch in kWh gem. letzter Jahresabrechnung"},null,null,null,null,null,null,"kWh","i",{"$f":"IF(H27=\"Nein\",IF(H28=\"Erdgas\",\"Den Erdgasverbrauch entnehmen Sie bitte der letzten Jahresabrechnung, deren Abrechnungszeitraum zwischen 31. Jänner 2021 und 31. Jänner 2022 endet.\",\"Den Stromverbrauch entnehmen Sie bitte der letzten Jahresabrechnung, deren Abrechnungszeitraum zwischen 31. Jänner 2021 und 31. Jänner 2022 endet.\"),IF(H28=\"Erdgas\",\"Bitte geben Sie den Erdgasverbrauch für den gesamten Zeitraum von 1. Jänner 2021 und 31. Dezember 2021 an.\",\"Bitte geben Sie den Stromverbrauch für den gesamten Zeitraum von 1. Jänner 2021 und 31. Dezember 2021 an.\"))","v":"Den Stromverbrauch entnehmen Sie bitte der letzten Jahresabrechnung, deren Abrechnungszeitraum zwischen 31. Jänner 2021 und 31. Jänner 2022 endet."}]
{"$rows_left_out":17}
{"sheet":"2 - Strom und Erdgas 2022","index":2,"n_rows":47,"n_cols":18,"rows_kept":47,"cut":false,"hidden":false,"merged":[]}
[]
[null,"Energiekostenzuschuss"]
[null,"In drei Schritten zur Berechnung Ihres möglichen Zuschusses in der Basisstufe (für Unternehmen mit Energie-, Strom- und Treibstoffbeschaffungskosten bis EUR 16 Mio.)"]
[]
[]
[null,"Schritt 2: Berechnung des Durchschnittsarbeitspreises im Förderungszeitraum und der Preissteigerung"]
[]
[null,"Im zweiten Schritt ersuchen wir Sie um Angaben zum Arbeitspreis und zum Strom/-Erdgasverbrauch im Förderungszeitraum. Der Förderungszeitraum erstreckt sich von 1. Februar bis 30. September 2022."]
[null,"Mehrere Zählpunkte mit identem Tarif können mit einer fiktiven Zählpunktnummer zusammengefasst werden (beispielsweise 1111 für Strom und 2222 für Erdgas)."]
[]
[]
[null,"Zählpunkt",null,null,null,null,null,null,"2022-02-01","2022-03-01","2022-04-01","2022-05-01","2022-06-01","2022-07-01","2022-08-01","2022-09-01"]
[null,"Zählpunktnummer (die letzten vier Stellen)",null,null,null,null,null,null,null,null,null,null,null,null,null,null,"i","Bitte geben Sie nur die letzten vier Stellen Ihrer Zählpunktnummer an."]
[null,"Lastprofilzähler oder genormtes intelligentes Messgerät verfügbar",null,null,null,null,null,{"$f":"IFERROR(VLOOKUP(H13,'1 - Strom und Erdgas 2021'!H:AA,17,FALSE),\"\")","v":0}]
[null,"Energieart",null,null,null,null,null,{"$f":"IFERROR(VLOOKUP(H13,'1 - Strom und Erdgas 2021'!H:AA,18,FALSE),\"\")","v":0},null,null,null,null,null,null,null,null,"i","Bitte geben Sie die jeweilige Energieart an."]
[null,{"$f":"IF(H15=\"Erdgas\",\"Arbeitspreis pro kWh Erdgas in EUR\",\"Arbeitspreis pro kWh Strom in EUR\")","v":"Arbeitspreis pro kWh Strom in EUR"},null,null,null,null,{"$f":"IFERROR(SUMPRODUCT(I16:P16,I17:P17),\"\")","v":0},null,null,null,null,null,null,null,null,null,"i",{"$f":"IF(H15=\"Erdgas\",\"Erdgaskosten exkl. Steuern, Abgaben, Netzentgelte, etc.\",\"Stromkosten exkl. Steuern, Abgaben, Netzentgelte, etc.\")","v":"Stromkosten exkl. Steuern, Abgaben, Netzentgelte, etc."}]
[null,{"$f":"IF(AND(H15=\"Erdgas\",H14=\"Nein\"),\"Aliquoter Erdgasverbrauch in kWh von 1. Februar bis 30. September 2022\",IF(H15=\"Erdgas\",\"Erdgasverbrauch in kWh von 1. Februar bis 30. September 2022\",IF(AND(H15=\"Strom\",H14=\"Nein\"),\"Aliquoter Stromverbrauch in kWh von 1. Februar bis 30. September 2022\",\"Stromverbrauch in kWh von 1. Februar bis 30. September 2022\")))","v":"Stromverbrauch in kWh von 1. Februar bis 30. September 2022"},null,null,null,null,null,{"$f":"SUM(I17:P17)","v":0},{"$f":"IFERROR(IF(H14=\"Nein\",VLOOKUP(H13,'1 - Strom und Erdgas 2021'!H:AA,20,FALSE)/12,\"\"),\"\")","v":""},{"$f":"IFERROR(IF(H14=\"Nein\",VLOOKUP(H13,'1 - Strom und Erdgas 2021'!H:AA,20,FALSE)/12,\"\"),\"\")","v":""},{"$f":"IFERROR(IF(H14=\"Nein\",VLOOKUP(H13,'1 - Strom und Erdgas 2021'!H:AA,20,FALSE)/12,\"\"),\"\")","v":""},{"$f":"IFERROR(IF(H14=\"Nein\",VLOOKUP(H13,'1 - Strom und Erdgas 2021'!H:AA,20,FALSE)/12,\"\"),\"\")","v":""},{"$f":"IFERROR(IF(H14=\"Nein\",VLOOKUP(H13,'1 - Strom und Erdgas 2021'!H:AA,20,FALSE)/12,\"\"),\"\")","v":""},{"$f":"IFERROR(IF(H14=\"Nein\",VLOOKUP(H13,'1 - Strom und Erdgas 2021'!H:AA,20,FALSE)/12,\"\"),\"\")","v":""},{"$f":"IFERROR(IF(H14=\"Nein\",VLOOKUP(H13,'1 - Strom und Erdgas 2021'!H:AA,20,FALSE)/12,\"\"),\"\")","v":""},{"$f":"IFERROR(IF(H14=\"Nein\",VLOOKUP(H13,'1 - Strom und Erdgas 2021'!H:AA,20,FALSE)/12,\"\"),\"\")","v":""},"i",{"$f":"IFERROR(IF(H14=\"Nein\",\"Vorbefüllte Verbrauchswerte wurden aliquot (d.h. 1/12) aus dem Jahr 2021 übernommen.\",\"Bitte ergänzen Sie die monatlichen Verbrauchswerte gem. Lastprofilzähler\"),\"\")","v":"Bitte ergänzen Sie die monatlichen Verbrauchswerte gem. Lastprofilzähler"}]
[]
[null,"Zählpunkt",null,null,null,null,null,null,"2022-02-01","2022-03-01","2022-04-01","2022-05-01","2022-06-01","2022-07-01","2022-08-01","2022-09-01"]
[null,"Zählpunktnummer (die letzten vier Stellen)",null,null,null,null,null,null,null,null,null,null,null,null,null,null,"i","Bitte geben Sie nur die letzten vier Stellen Ihrer Zählpunktnummer an."]
[null,"Lastprofilzähler oder genormtes intelligentes Messgerät verfügbar",null,null,null,null,null,{"$f":"IFERROR(VLOOKUP(H20,'1 - Strom und Erdgas 2021'!H:AA,17,FALSE),\"\")","v":0}]
[null,"Energieart",null,null,null,null,null,{"$f":"IFERROR(VLOOKUP(H20,'1 - Strom und Erdgas 2021'!H:AA,18,FALSE),\"\")","v":0},null,null,null,null,null,null,null,null,"i","Bitte geben Sie die jeweilige Energieart an."]
[null,{"$f":"IF(H22=\"Erdgas\",\"Arbeitspreis pro kWh Erdgas in EUR\",\"Arbeitspreis pro kWh Strom in EUR\")","v":"Arbeitspreis pro kWh Strom in EUR"},null,null,null,null,{"$f":"IFERROR(SUMPRODUCT(I23:P23,I24:P24),\"\")","v":0},null,null,null,null,null,null,null,null,null,"i",{"$f":"IF(H22=\"Erdgas\",\"Erdgaskosten exkl. Steuern, Abgaben, Netzentgelte, etc.\",\"Stromkosten exkl. Steuern, Abgaben, Netzentgelte, etc.\")","v":"Stromkosten exkl. Steuern, Abgaben, Netzentgelte, etc."}]
[null,{"$f":"IF(AND(H22=\"Erdgas\",H21=\"Nein\"),\"Aliquoter Erdgasverbrauch in kWh von 1. Februar bis 30. September 2022\",IF(H22=\"Erdgas\",\"Erdgasverbrauch in kWh von 1. Februar bis 30. September 2022\",IF(AND(H22=\"Strom\",H21=\"Nein\"),\"Aliquoter Stromverbrauch in kWh von 1. Februar bis 30. September 2022\",\"Stromverbrauch in kWh von 1. Februar bis 30. September 2022\")))","v":"Stromverbrauch in kWh von 1. Februar bis 30. September 2022"},null,null,null,null,null,{"$f":"SUM(I24:P24)","v":0},{"$f":"IFERROR(IF(H21=\"Nein\",VLOOKUP(H20,'1 - Strom und Erdgas 2021'!H:AA,20,FALSE)/12,\"\"),\"\")","v":""},{"$f":"IFERROR(IF(H21=\"Nein\",VLOOKUP(H20,'1 - Strom und Erdgas 2021'!H:AA,20,FALSE)/12,\"\"),\"\")","v":""},{"$f":"IFERROR(IF(H21=\"Nein\",VLOOKUP(H20,'1 - Strom und Erdgas 2021'!H:AA,20,FALSE)/12,\"\"),\"\")","v":""},{"$f":"IFERROR(IF(H21=\"Nein\",VLOOKUP(H20,'1 - Strom und Erdgas 2021'!H:AA,20,FALSE)/12,\"\"),\"\")","v":""},{"$f":"IFERROR(IF(H21=\"Nein\",VLOOKUP(H20,'1 - Strom und Erdgas 2021'!H:AA,20,FALSE)/12,\"\"),\"\")","v":""},{"$f":"IFERROR(IF(H21=\"Nein\",VLOOKUP(H20,'1 - Strom und Erdgas 2021'!H:AA,20,FALSE)/12,\"\"),\"\")","v":""},{"$f":"IFERROR(IF(H21=\"Nein\",VLOOKUP(H20,'1 - Strom und Erdgas 2021'!H:AA,20,FALSE)/12,\"\"),\"\")","v":""},{"$f":"IFERROR(IF(H21=\"Nein\",VLOOKUP(H20,'1 - Strom und Erdgas 2021'!H:AA,20,FALSE)/12,\"\"),\"\")","v":""},"i",{"$f":"IFERROR(IF(H21=\"Nein\",\"Vorbefüllte Verbrauchswerte wurden aliquot (d.h. 1/12) aus dem Jahr 2021 übernommen.\",\"Bitte ergänzen Sie die monatlichen Verbrauchswerte gem. Lastprofilzähler\"),\"\")","v":"Bitte ergänzen Sie die monatlichen Verbrauchswerte gem. Lastprofilzähler"}]
[]
[]
[]
[]
[null,"Für detaillierte Berechnungsinformationen klicken Sie bitte auf das + auf der linken Seite."]
[]
{"$rows_left_out":18}
{"sheet":"3 - Treibstoff und Zuschuss","index":3,"n_rows":27,"n_cols":12,"rows_kept":27,"cut":false,"hidden":false,"merged":[[26,11,27,23]]}
[]
[null,"Energiekostenzuschuss"]
[null,"In drei Schritten zur Berechnung Ihres möglichen Zuschusses in der Basisstufe (für Unternehmen mit Energie-, Strom- und Treibstoffbeschaffungskosten bis EUR 16 Mio.)"]
[]
[]
[null,"Schritt 3: Treibstoffverbrauch und Durchschnittspreis"]
[]
[null,"Im dritten Schritt ersuchen wir Sie um Angaben zum Treibstoffverbrauch und den Treibstoffkosten."]
[]
[]
[null,"Benzin"]
[null,"Benzinverbrauch im Förderungszeitraum",null,null,null,null,null,null,null,"Liter","i","Der Förderungszeitraum erstreckt sich von 1. Februar 2022 bis 30. September 2022."]
[null,"Durchschnittlicher Literpreis (brutto) im Förderungszeitraum in EUR",null,null,null,null,null,null,null,"EUR","i","Der Bruttopreis enthält die MÖSt und USt und entspricht der Preisangabe an der Zapfsäule. Anm.: Der für die Förderung relevante Nettopreis wird automatisch errechnet."]
[null,null,null,null,null,null,null,null,{"$f":"IF(AND(I13>0,I13<=1.2984),\"Da keine Preissteigerung vorliegt, ist der Benzinverbrauch nicht förderungsfähig\",\"\")","v":""}]
[null,"Diesel"]
[null,"Dieselverbrauch im Förderungszeitraum",null,null,null,null,null,null,null,"Liter","i","Der Förderungszeitraum erstreckt sich von 1. Februar 2022 bis 30. September 2022."]
[null,"Durchschnittlicher Literpreis (brutto) im Förderungszeitraum in EUR",null,null,null,null,null,null,null,"EUR","i","Der Bruttopreis enthält die MÖSt und USt und entspricht der Preisangabe an der Zapfsäule. Anm.: Der für die Förderung relevante Nettopreis wird automatisch errechnet."]
[null,null,null,null,null,null,null,null,{"$f":"IF(AND(I17>0,I17<=1.1964),\"Da keine Preissteigerung vorliegt, ist der Dieselverbrauch nicht förderungsfähig\",\"\")","v":""}]
[]
[]
[null,"Ihr Zuschuss:"]
[]
[null,"Strom",null,null,null,null,null,null,{"$f":"IFERROR('2 - Strom und Erdgas 2022'!H38*0.3*(MIN('2 - Strom und Erdgas 2022'!H32,1000000)+'2 - Strom und Erdgas 2022'!H33),0)","v":0},"EUR","i","Die Zuschusshöhe errechnet sich wie folgt: Preisanstieg x Verbrauch (bei Zählpunkten ohne Lastprofilzähler max. 1.000.000 kWh) x 30 % Zuschussquote."]
[null,"Erdgas",null,null,null,null,null,null,{"$f":"IFERROR('2 - Strom und Erdgas 2022'!H47*0.3*(MIN('2 - Strom und Erdgas 2022'!H41,1000000)+'2 - Strom und Erdgas 2022'!H42),\"\")","v":0},"EUR","i","Die Zuschusshöhe errechnet sich wie folgt: Preisanstieg x Verbrauch (bei Zählpunkten ohne Lastprofilzähler max. 1.000.000 kWh) x 30 % Zuschussquote."]
[null,"Treibstoffe",null,null,null,null,null,null,{"$f":"(MAX(I16*(I17/1.2-0.397-0.6),0)+MAX(I12*(I13/1.2-0.482-0.6),0))*0.3","v":0},"EUR","i","Die Zuschusshöhe errechnet sich, indem der Preisanstieg (d.h. der durchschnittliche Nettopreis - 60 Cent) mit dem Verbrauch und der Zuschussquote von 30 % multipliziert wird."]
[]
[null,"Ihr möglicher Gesamtzuschuss",null,null,null,null,null,null,{"$f":"IFERROR(IF((SUM(I23:I25))>2000,MIN(IF(SUM(I23:I25)<=20000,SUM(I23:I25)+500,SUM(I23:I25)),400000),0),\"\")","v":0},"EUR","i",{"$f":"IF(I27<=2000,\"Der mögliche Gesamtzuschuss liegt unter der betragsmäßigen Untergrenze von EUR 2.000,- .\",IF(I27<=20000,\"Die Berechnung des Zuschusses (max. 400 TEUR) erfolgt auf Basis Ihrer Angaben, die im Zuge der Antragstellung geprüft werden können. Der Energiekostenzuschuss beinhaltet einen Pauschalbetrag in Höhe von € 500,- zur Abdeckung der Steuerberatungskosten.\",\"Die Berechnung des Zuschusses (max. 400 TEUR) erfolgt auf Basis Ihrer Angaben, die im Zuge der Antragstellung geprüft werden können.\"))","v":"Der mögliche Gesamtzuschuss liegt unter der betragsmäßigen Untergrenze von EUR 2.000,- ."}]

{"sheet":"Import","index":4,"n_rows":9,"n_cols":5,"rows_kept":9,"cut":false,"hidden":true,"merged":[]}
["Field","Value",null,"Validation","Value"]
["AceStromverbrauchimfoerderzeitraum",{"$f":"MIN('2 - Strom und Erdgas 2022'!H32,1000000)+'2 - Strom und Erdgas 2022'!H33","v":0},null,"Berechnungsart",100000000]
["AceDurchschnittspreisstromzeitraum",{"$f":"'2 - Strom und Erdgas 2022'!H36","v":0},null,"Kontrollfeld",{"$f":"IF(AND(_xlfn.ISFORMULA('2 - Strom und Erdgas 2022'!H34)=TRUE,_xlfn.ISFORMULA('2 - Strom und Erdgas 2022'!H36)=TRUE,_xlfn.ISFORMULA('2 - Strom und Erdgas 2022'!H37)=TRUE,_xlfn.ISFORMULA('2 - Strom und Erdgas 2022'!H43)=TRUE,_xlfn.ISFORMULA('2 - Strom und Erdgas 2022'!H45)=TRUE,_xlfn.ISFORMULA('2 - Strom und Erdgas 2022'!H46)=TRUE,OR(AND('3 - Treibstoff und Zuschuss'!I12=\"\",'3 - Treibstoff und Zuschuss'!I13=\"\"),AND('3 - Treibstoff und Zuschuss'!I12>0,'3 - Treibstoff und Zuschuss'!I13>0)),OR(AND('3 - Treibstoff und Zuschuss'!I16=\"\",'3 - Treibstoff und Zuschuss'!I17=\"\"),AND('3 - Treibstoff und Zuschuss'!I16>0,'3 - Treibstoff und Zuschuss'!I17>0))),\"OK\",\"NOK\")","v":"OK"}]
["AceDurchschnittspreisstromvergleich",{"$f":"'2 - Strom und Erdgas 2022'!H37","v":0},null,"Version",{"$f":"'1 - Strom und Erdgas 2021'!C4","v":"1.4"}]
["AceGasverbrauchzeitraum",{"$f":"MIN('2 - Strom und Erdgas 2022'!H41,1000000)+'2 - Strom und Erdgas 2022'!H42","v":0}]
["AceDurchschnittspreisgaszeitraum",{"$f":"'2 - Strom und Erdgas 2022'!H45","v":0}]
["AceDurchschnittspreisgasvergleich",{"$f":"'2 - Strom und Erdgas 2022'!H46","v":0}]
["AceTreibstoffverbrauchzeitraum",{"$f":"IF('3 - Treibstoff und Zuschuss'!I13>1.2984,'3 - Treibstoff und Zuschuss'!I12,0)+IF('3 - Treibstoff und Zuschuss'!I17>1.1964,'3 - Treibstoff und Zuschuss'!I16,0)","v":0}]
["AceDurchschnittspreistreibstoffezeitraum",{"$f":"IFERROR(IF('3 - Treibstoff und Zuschuss'!I13>1.2984,('3 - Treibstoff und Zuschuss'!I13/1.2-0.482)*'3 - Treibstoff und Zuschuss'!I12/(Import!B8),0)+IF('3 - Treibstoff und Zuschuss'!I17>1.1964,('3 - Treibstoff und Zuschuss'!I17/1.2-0.397)*'3 - Treibstoff und Zuschuss'!I16/(Import!B8),0),0)","v":0}]

{"sheet":"Zählpunkte Schritt 1","index":5,"n_rows":6,"n_cols":27,"rows_kept":6,"cut":false,"hidden":true,"merged":[]}
[null,"Zählpunkt"]
[null,"Zählpunktnummer (nur die letzten vier Stellen)",null,null,null,null,null,null,null,"i","Die Zählpunktnummer beginnt mit AT und kann der Abrechnung entnommen werden. Bitte geben Sie nur die letzten vier Stellen Ihrer Zählpunktnummer an.",null,null,null,null,null,null,null,null,null,null,null,null,{"$f":"H3","v":"Nein"},{"$f":"H4","v":0},{"$f":"H5","v":0},{"$f":"H6","v":0}]
[null,"Lastprofilzähler oder genormtes intelligentes Messgerät verfügbar",null,null,null,null,null,"Nein",null,"i","Ist ein Lastprofilzähler (Messgerät für Großkunden) oder ein genormtes intelligentes Messgerät mit monatlicher Abrechnung verfügbar, erfolgt die Zuschussberechnung gem. Pkt. 9.1.1 der Richtlinie."]
[null,"Energieart",null,null,null,null,null,null,null,"i","Bitte geben Sie die jeweilige Energieart an."]
[null,{"$f":"IF(H4=\"Erdgas\",\"Nettorechnungsbetrag (Erdgas)\",\"Nettorechnungsbetrag (Strom)\")","v":"Nettorechnungsbetrag (Strom)"},null,null,null,null,null,null,"EUR","i",{"$f":"IF(H4=\"Erdgas\",\"Der Nettorechnungsbetrag bezeichnet die Kosten für die verbrauchten Kilowattstunden (kWh) Erdgas (exkl. Steuern, Abgaben, Netzentgelte, etc.).\",\"Der Nettorechnungsbetrag bezeichnet die Kosten für die verbrauchten Kilowattstunden (kWh) Strom (exkl. Steuern, Abgaben, Netzentgelte, etc.).\")","v":"Der Nettorechnungsbetrag bezeichnet die Kosten für die verbrauchten Kilowattstunden (kWh) Strom (exkl. Steuern, Abgaben, Netzentgelte, etc.)."}]
[null,{"$f":"IF(H3=\"Nein\",IF(H4=\"Erdgas\",\"Erdgasverbrauch in kWh gem. letzter Jahresabrechnung\",\"Stromverbrauch in kWh gem. letzter Jahresabrechnung\"),IF(H4=\"Erdgas\",\"Erdgasverbrauch in kWh im Kalenderjahr 2021\",\"Stromverbrauch in kWh im Kalenderjahr 2021\"))","v":"Stromverbrauch in kWh gem. letzter Jahresabrechnung"},null,null,null,null,null,null,"kWh","i",{"$f":"IF(H3=\"Nein\",IF(H4=\"Erdgas\",\"Den Erdgasverbrauch entnehmen Sie bitte der letzten Jahresabrechnung, deren Abrechnungszeitraum zwischen 31. Jänner 2021 und 31. Jänner 2022 endet.\",\"Den Stromverbrauch entnehmen Sie bitte der letzten Jahresabrechnung, deren Abrechnungszeitraum zwischen 31. Jänner 2021 und 31. Jänner 2022 endet.\"),IF(H4=\"Erdgas\",\"Bitte geben Sie den Erdgasverbrauch für den gesamten Zeitraum von 1. Jänner 2021 und 31. Dezember 2021 an.\",\"Bitte geben Sie den Stromverbrauch für den gesamten Zeitraum von 1. Jänner 2021 und 31. Dezember 2021 an.\"))","v":"Den Stromverbrauch entnehmen Sie bitte der letzten Jahresabrechnung, deren Abrechnungszeitraum zwischen 31. Jänner 2021 und 31. Jänner 2022 endet."}]

{"sheet":"Zählpunkte Schritt 2","index":6,"n_rows":7,"n_cols":18,"rows_kept":7,"cut":false,"hidden":true,"merged":[]}
[]
[null,"Zählpunkt",null,null,null,null,null,null,"2022-02-01","2022-03-01","2022-04-01","2022-05-01","2022-06-01","2022-07-01","2022-08-01","2022-09-01"]
[null,"Zählpunktnummer (die letzten vier Stellen)",null,null,null,null,null,null,null,null,null,null,null,null,null,null,"i","Bitte geben Sie nur die letzten vier Stellen Ihrer Zählpunktnummer an."]
[null,"Lastprofilzähler oder genormtes intelligentes Messgerät verfügbar",null,null,null,null,null,{"$f":"IFERROR(VLOOKUP(H3,'1 - Strom und Erdgas 2021'!H:AA,17,FALSE),\"\")","v":0}]
[null,"Energieart",null,null,null,null,null,{"$f":"IFERROR(VLOOKUP(H3,'1 - Strom und Erdgas 2021'!H:AA,18,FALSE),\"\")","v":0},null,null,null,null,null,null,null,null,"i","Bitte geben Sie die jeweilige Energieart an."]
[null,{"$f":"IF(H5=\"Erdgas\",\"Arbeitspreis pro kWh Erdgas in EUR\",\"Arbeitspreis pro kWh Strom in EUR\")","v":"Arbeitspreis pro kWh Strom in EUR"},null,null,null,null,{"$f":"IFERROR(SUMPRODUCT(I6:P6,I7:P7),\"\")","v":0},null,null,null,null,null,null,null,null,null,"i",{"$f":"IF(H5=\"Erdgas\",\"Erdgaskosten exkl. Steuern, Abgaben, Netzentgelte, etc.\",\"Stromkosten exkl. Steuern, Abgaben, Netzentgelte, etc.\")","v":"Stromkosten exkl. Steuern, Abgaben, Netzentgelte, etc."}]
[null,{"$f":"IF(AND(H5=\"Erdgas\",H4=\"Nein\"),\"Aliquoter Erdgasverbrauch in kWh von 1. Februar bis 30. September 2022\",IF(H5=\"Erdgas\",\"Erdgasverbrauch in kWh von 1. Februar bis 30. September 2022\",IF(AND(H5=\"Strom\",H4=\"Nein\"),\"Aliquoter Stromverbrauch in kWh von 1. Februar bis 30. September 2022\",\"Stromverbrauch in kWh von 1. Februar bis 30. September 2022\")))","v":"Stromverbrauch in kWh von 1. Februar bis 30. September 2022"},null,null,null,null,null,{"$f":"SUM(I7:P7)","v":0},{"$f":"IFERROR(IF(H4=\"Nein\",VLOOKUP(H3,'1 - Strom und Erdgas 2021'!H:AA,20,FALSE)/12,\"\"),\"\")","v":""},{"$f":"IFERROR(IF(H4=\"Nein\",VLOOKUP(H3,'1 - Strom und Erdgas 2021'!H:AA,20,FALSE)/12,\"\"),\"\")","v":""},{"$f":"IFERROR(IF(H4=\"Nein\",VLOOKUP(H3,'1 - Strom und Erdgas 2021'!H:AA,20,FALSE)/12,\"\"),\"\")","v":""},{"$f":"IFERROR(IF(H4=\"Nein\",VLOOKUP(H3,'1 - Strom und Erdgas 2021'!H:AA,20,FALSE)/12,\"\"),\"\")","v":""},{"$f":"IFERROR(IF(H4=\"Nein\",VLOOKUP(H3,'1 - Strom und Erdgas 2021'!H:AA,20,FALSE)/12,\"\"),\"\")","v":""},{"$f":"IFERROR(IF(H4=\"Nein\",VLOOKUP(H3,'1 - Strom und Erdgas 2021'!H:AA,20,FALSE)/12,\"\"),\"\")","v":""},{"$f":"IFERROR(IF(H4=\"Nein\",VLOOKUP(H3,'1 - Strom und Erdgas 2021'!H:AA,20,FALSE)/12,\"\"),\"\")","v":""},{"$f":"IFERROR(IF(H4=\"Nein\",VLOOKUP(H3,'1 - Strom und Erdgas 2021'!H:AA,20,FALSE)/12,\"\"),\"\")","v":""},"i",{"$f":"IFERROR(IF(H4=\"Nein\",\"Vorbefüllte Verbrauchswerte wurden aliquot (d.h. 1/12) aus dem Jahr 2021 übernommen.\",\"Bitte ergänzen Sie die monatlichen Verbrauchswerte gem. Lastprofilzähler\"),\"\")","v":"Bitte ergänzen Sie die monatlichen Verbrauchswerte gem. Lastprofilzähler"}]

{"sheet":"Liste","index":7,"n_rows":2,"n_cols":2,"rows_kept":2,"cut":false,"hidden":true,"merged":[]}
["Strom","Nein"]
["Erdgas","Ja"]