{"text_format":"1","workbook":"xlsx","n_sheets":8,"sheets":["Übersicht","1 - Vergleichszeitraum","2 - Förderzeitraum","3 - Unternehmensangaben","Import","Zählpunkte Schritt 1","Zählpunkte Schritt 2","Liste"],"not_rendered":{"charts":0,"images":6,"macros":1,"external_links":0,"defined_names":4,"comments":0,"pivot_tables":0},"unopened":[],"bounds":{"document_bytes":16777216,"sheet_cells":100000,"rows_first":2000,"rows_last":500,"rows_between":2000,"halvings":0,"cell_chars":16384,"cell_head_chars":4096},"cells_cut":0,"cells_raw":0,"read":"whole","date_system":"1900"}

{"sheet":"Übersicht","index":0,"n_rows":96,"n_cols":18,"rows_kept":96,"cut":false,"hidden":false,"merged":[[5,4,5,7]]}
[]
[null,"Energiekostenzuschuss"]
[null,"Ermitteln Sie in wenigen Schritte Ihren Zuschuss in der Berechnungsstufe (Stufe 2 bis Stufe 4)"]
[null,"Version","1.0.0"]
[]
[null,"Ihre firmeninterne Referenz",null,null,null,null,null,null,"i","Firmenwortlaut, internes Aktenkennzeichen, o.ä."]
[]
[null,"Einleitung"]
[]
[null,"Bitte befüllen Sie die folgenden Tabellenblätter, um Ihren Zuschuss zu berechnen:"]
[]
[null,"1 - Vergleichszeitraum…..........................",null,null,{"$f":"IF(OR(AND('1 - Vergleichszeitraum'!H14=\"\",COUNTIFS('1 - Vergleichszeitraum'!H:H,\"Strom\")>0),AND('1 - Vergleichszeitraum'!H19=\"\",COUNTIFS('1 - Vergleichszeitraum'!H:H,\"Erdgas\")>0),AND('1 - Vergleichszeitraum'!H14>0,COUNTIFS('1 - Vergleichszeitraum'!H:H,\"Strom\")=0),AND('1 - Vergleichszeitraum'!H19>0,COUNTIFS('1 - Vergleichszeitraum'!H:H,\"Erdgas\")=0)),\"Eingaben offen\",IF(AND('1 - Vergleichszeitraum'!H14>0,COUNTIFS('1 - Vergleichszeitraum'!H:H,\"Strom\")>0),\"Eingaben vorhanden\",IF(AND('1 - Vergleichszeitraum'!H19>0,COUNTIFS('1 - Vergleichszeitraum'!H:H,\"Erdgas\")>0),\"Eingaben vorhanden\",\"Eingaben offen\")))","v":"Eingaben offen"}]
[null,"2 - Förderzeitraum…................................",null,null,{"$f":"IF('2 - Förderzeitraum'!H14,\"Eingaben vorhanden\",\"Eingaben offen\")","v":"Eingaben offen"}]
[null,"3 - Unternehmensangaben…....................",null,null,{"$f":"IF((SUM(I42:P42))<1200000,\"Keine Eingaben erforderlich\",IF(AND('3 - Unternehmensangaben'!D12<>\"\",'3 - Unternehmensangaben'!F15<>\"\"),\"Eingaben vorhanden\",\"Eingaben offen\"))","v":"Keine Eingaben erforderlich"}]
[]
[]
[null,"Ausgehend von Ihren Angaben beläuft sich Ihr Energiekostenzuschuss auf:",null,null,null,null,null,null,{"$f":"IF(SUM(I42:P42)<=2000,0,IF(AND(MIN(SUM(I96:P96),SUMIF('3 - Unternehmensangaben'!D12:K12,\"<0\",'3 - Unternehmensangaben'!D12:K12)*0.8*-1)>25000000,'3 - Unternehmensangaben'!F15=\"Ja\"),MIN(SUM(I96:P96),SUMIF('3 - Unternehmensangaben'!D12:K12,\"<0\",'3 - Unternehmensangaben'!D12:K12)*0.8*-1,50000000),IF(MIN(SUM(I69:P69),SUMIF('3 - Unternehmensangaben'!D12:K12,\"<0\",'3 - Unternehmensangaben'!D12:K12)*0.8*-1)>2000000,MIN(SUM(I69:P69),SUMIF('3 - Unternehmensangaben'!D12:K12,\"<0\",'3 - Unternehmensangaben'!D12:K12)*0.8*-1,25000000),MIN(SUM(Übersicht!I42:P42),2000000))))","v":0},{"$f":"IF(AND(MIN(SUM(I96:P96),SUMIF('3 - Unternehmensangaben'!D12:K12,\"<0\",'3 - Unternehmensangaben'!D12:K12)*0.8*-1)>25000000,'3 - Unternehmensangaben'!F15=\"Ja\"),\"EUR in der Berechnungsstufe (Stufe 4)\",IF(MIN(SUM(I69:P69),SUMIF('3 - Unternehmensangaben'!D12:K12,\"<0\",'3 - Unternehmensangaben'!D12:K12)*0.8*-1)>2000000,\"EUR in der Berechnungsstufe (Stufe 3)\",\"EUR in der Berechnungsstufe (Stufe 2)\"))","v":"EUR in der Berechnungsstufe (Stufe 2)"},null,null,"i",{"$f":"IF(I17<=2000,\"Der mögliche Energiekostenzuschuss liegt unter der betragsmäßigen Untergrenze von EUR 2.000,-\",\"\")","v":"Der mögliche Energiekostenzuschuss liegt unter der betragsmäßigen Untergrenze von EUR 2.000,-"}]
[]
[null,"Für detaillierte Berechnungsinformationen klicken Sie bitte auf das + auf der linken Seite."]
[]
{"$rows_left_out":77}
{"sheet":"1 - Vergleichszeitraum","index":1,"n_rows":37,"n_cols":24,"rows_kept":37,"cut":false,"hidden":false,"merged":[[11,10,12,22],[16,10,17,22]]}
[]
[null,"Energiekostenzuschuss"]
[null,"Ermitteln Sie in wenigen Schritte Ihren Zuschuss in der Berechnungsstufe (Stufe 2 bis Stufe 4)"]
[]
[]
[null,"Schritt 1: Angaben zur Vergleichsperiode 2021"]
[]
[null,"Um die Preissteigerungen berechnen zu können, benötigen wir im ersten Schritt Angaben zur Vergleichsperiode 2021."]
[]
[]
[null,"Jahresangaben Strom"]
[null,"Summe der Nettorechnungsbeträge aller Zählpunkte",null,null,null,null,null,null,"EUR","i","Der Nettorechnungsbetrag bezeichnet die Kosten für die verbrauchten Kilowattstunden (kWh) Strom (exkl. Steuern, Abgaben, Netzentgelte, etc.) im Zeitraum 1. Jänner bis 31. Dezember 2021."]
[null,"Stromverbrauch aller Zählpunkte in kWh im Gesamtjahr",null,null,null,null,null,null,"kWh"]
[null,"Errechneter Durchschnittsarbeitspreis aller Zählpunkte",null,null,null,null,null,{"$f":"IFERROR(H12/H13,0)","v":0},"EUR"]
[]
[null,"Jahresangaben Erdgas"]
[null,"Summe der Nettorechnungsbeträge aller Zählpunkte",null,null,null,null,null,null,"EUR","i","Der Nettorechnungsbetrag bezeichnet die Kosten für die verbrauchten Kilowattstunden (kWh) Erdgas (exkl. Steuern, Abgaben, Netzentgelte, etc.) im Zeitraum 1. Jänner bis 31. Dezember 2021."]
[null,"Stromverbrauch aller Zählpunkte in kWh im Gesamtjahr",null,null,null,null,null,null,"kWh"]
[null,"Errechneter Durchschnittsarbeitspreis aller Zählpunkte",null,null,null,null,null,{"$f":"IFERROR(H17/H18,0)","v":0},"EUR"]
[]
{"$rows_left_out":18}
{"sheet":"2 - Förderzeitraum","index":2,"n_rows":25,"n_cols":40,"rows_kept":25,"cut":false,"hidden":false,"merged":[]}
[]
[null,"Energiekostenzuschuss"]
[null,"Ermitteln Sie in wenigen Schritte Ihren Zuschuss in der Berechnungsstufe (Stufe 2 bis Stufe 4)"]
[]
[]
[null,"Schritt 2: Angaben zum Förderungszeitraum"]
[]
[null,"Im zweiten Schritt ersuchen wir Sie um Angaben für den Förderungszeitraum 1. Februar bis 30. September 2022."]
[null,"Mehrere Zählpunkte mit identem Tarif können mit einer fiktiven Zählpunktnummer zusammengefasst werden (beispielsweise 1111 für Strom und 2222 für Erdgas).",null,null,null,null,null,null,null,null,null,null,null,null,null,null,null,null,null,null,null,null,null,null,null,"Endsumme Strom",null,null,null,null,null,null,{"$f":"IFERROR(SUMIFS(I:I,$B:$B,\"Stromverbrauch in kWh*\"),\"\")","v":0},0,0,0,0,0,0,0]
[null,null,null,null,null,null,null,null,null,null,null,null,null,null,null,null,null,null,null,null,null,null,null,null,null,"Endsumme Erdgas",null,null,null,null,null,null,{"$f":"IFERROR(SUMIFS(I:I,$B:$B,\"Erdgasverbrauch in kWh*\"),\"\")","v":0},0,0,0,0,0,0,0]
[]
[]
[null,"Zählpunkt",null,null,null,null,null,null,"2022-02-01","2022-03-01","2022-04-01","2022-05-01","2022-06-01","2022-07-01","2022-08-01","2022-09-01"]
[null,"Zählpunktnummer (die letzten vier Stellen)",null,null,null,null,null,null,null,null,null,null,null,null,null,null,"i","Bitte geben Sie nur die letzten vier Stellen Ihrer Zählpunktnummer an."]
[null,"Energieart",null,null,null,null,null,{"$f":"IFERROR(VLOOKUP(H14,'1 - Vergleichszeitraum'!H:X,17,FALSE),\"\")","v":0},null,null,null,null,null,null,null,null,"i","Bitte geben Sie die jeweilige Energieart an."]
[null,{"$f":"IF(H15=\"Erdgas\",\"Arbeitspreis pro kWh Erdgas in EUR\",\"Arbeitspreis pro kWh Strom in EUR\")","v":"Arbeitspreis pro kWh Strom in EUR"},null,null,null,null,null,null,null,null,null,null,null,null,null,null,"i",{"$f":"IF(H15=\"Erdgas\",\"Erdgaskosten exkl. Steuern, Abgaben, Netzentgelte, etc.\",\"Stromkosten exkl. Steuern, Abgaben, Netzentgelte, etc.\")","v":"Stromkosten exkl. Steuern, Abgaben, Netzentgelte, etc."}]
[null,{"$f":"IF(H15=\"Erdgas\",\"Erdgasverbrauch in kWh von 1. Februar bis 30. September 2022\",\"Stromverbrauch in kWh von 1. Februar bis 30. September 2022\")","v":"Stromverbrauch in kWh von 1. Februar bis 30. September 2022"},null,null,null,null,null,null,null,null,null,null,null,null,null,null,"i","Bitte ergänzen Sie die monatlichen Verbrauchswerte gem. Lastprofilzähler."]
[null,{"$f":"IF(H15=\"Erdgas\",\"Zwischensumme Erdgas\",IF(H15=\"Strom\",\"Zwischensumme Strom\",\"\"))","v":""},null,null,null,null,null,null,{"$f":"IFERROR(I16*I17/IF($B18=\"Zwischensumme Strom\",'2 - Förderzeitraum'!AG$9,IF($B18=\"Zwischensumme Erdgas\",'2 - Förderzeitraum'!AG$10,\"\")),\"\")","v":""},{"$f":"IFERROR(J16*J17/IF($B18=\"Zwischensumme Strom\",'2 - Förderzeitraum'!AH$9,IF($B18=\"Zwischensumme Erdgas\",'2 - Förderzeitraum'!AH$10,\"\")),\"\")","v":""},{"$f":"IFERROR(K16*K17/IF($B18=\"Zwischensumme Strom\",'2 - Förderzeitraum'!AI$9,IF($B18=\"Zwischensumme Erdgas\",'2 - Förderzeitraum'!AI$10,\"\")),\"\")","v":""},{"$f":"IFERROR(L16*L17/IF($B18=\"Zwischensumme Strom\",'2 - Förderzeitraum'!AJ$9,IF($B18=\"Zwischensumme Erdgas\",'2 - Förderzeitraum'!AJ$10,\"\")),\"\")","v":""},{"$f":"IFERROR(M16*M17/IF($B18=\"Zwischensumme Strom\",'2 - Förderzeitraum'!AK$9,IF($B18=\"Zwischensumme Erdgas\",'2 - Förderzeitraum'!AK$10,\"\")),\"\")","v":""},{"$f":"IFERROR(N16*N17/IF($B18=\"Zwischensumme Strom\",'2 - Förderzeitraum'!AL$9,IF($B18=\"Zwischensumme Erdgas\",'2 - Förderzeitraum'!AL$10,\"\")),\"\")","v":""},{"$f":"IFERROR(O16*O17/IF($B18=\"Zwischensumme Strom\",'2 - Förderzeitraum'!AM$9,IF($B18=\"Zwischensumme Erdgas\",'2 - Förderzeitraum'!AM$10,\"\")),\"\")","v":""},{"$f":"IFERROR(P16*P17/IF($B18=\"Zwischensumme Strom\",'2 - Förderzeitraum'!AN$9,IF($B18=\"Zwischensumme Erdgas\",'2 - Förderzeitraum'!AN$10,\"\")),\"\")","v":""}]
[]
[null,"Zählpunkt",null,null,null,null,null,null,"2022-02-01","2022-03-01","2022-04-01","2022-05-01","2022-06-01","2022-07-01","2022-08-01","2022-09-01"]
{"$rows_left_out":6}
{"sheet":"3 - Unternehmensangaben","index":3,"n_rows":43,"n_cols":13,"rows_kept":43,"cut":false,"hidden":true,"merged":[[16,1,16,2]]}
[]
[null,"Energiekostenzuschuss"]
[null,"Ermitteln Sie in wenigen Schritte Ihren Zuschuss in der Berechnungsstufe (Stufe 2 bis Stufe 4)"]
[]
[]
[null,"Schritt 3: Angaben zu Ihrem Unternehmen"]
[]
[null,"Im dritten Schritt ersuchen wir Sie um Angaben zu Ihrem Unternehmen."]
[]
[]
[null,"EBITDA in EUR",null,"2022-02-01","2022-03-01","2022-04-01","2022-05-01","2022-06-01","2022-07-01","2022-08-01","2022-09-01"]
[null,"Betriebsergebnis in EUR",null,null,null,null,null,null,null,null,null,"i","Ergebnis vor Zinsen, Steuern und Abschreibungen ohne einmalige Wertminderungen"]
[]
[null,"Branchenzugehörigkeit"]
[null,"Ist Ihr Unternehmen in einer der unten aufgelisteten Branchen tätig?"]
[]
[null,"ÖNACE",null,"Branchenbezeichnung"]
[null,null,"0729","Sonstiger NE-Metallerzbergbau"]
[null,null,1310,"Spinnstoffaufbereitung und Spinnerei"]
[null,null,1395,"Herstellung von Vliesstoff und Erzeugnissen daraus (ohne Bekleidung)"]
{"$rows_left_out":24}
{"sheet":"Import","index":4,"n_rows":59,"n_cols":5,"rows_kept":59,"cut":false,"hidden":true,"merged":[]}
["Field","Value",null,"Validation","Value"]
["AceDurchschnittspreisstromvergleich",{"$f":"'1 - Vergleichszeitraum'!H14","v":0},null,"Berechnungsart",100000001]
["Monatsangaben.100000000.2.AceDurchschnittspreisproeinheit",{"$f":"Übersicht!I23","v":0},null,"Kontrollfeld",{"$f":"IF(AND(_xlfn.ISFORMULA(Übersicht!I23:P24),_xlfn.ISFORMULA(Übersicht!I27:P28),_xlfn.ISFORMULA(Übersicht!I32:P33),_xlfn.ISFORMULA(Übersicht!I36:P37)),\"OK\",\"NOK\")","v":"OK"}]
["Monatsangaben.100000000.3.AceDurchschnittspreisproeinheit",{"$f":"Übersicht!J23","v":0},null,"Version",{"$f":"Übersicht!C4","v":"1.0.0"}]
["Monatsangaben.100000000.4.AceDurchschnittspreisproeinheit",{"$f":"Übersicht!K23","v":0}]
["Monatsangaben.100000000.5.AceDurchschnittspreisproeinheit",{"$f":"Übersicht!L23","v":0}]
["Monatsangaben.100000000.6.AceDurchschnittspreisproeinheit",{"$f":"Übersicht!M23","v":0}]
["Monatsangaben.100000000.7.AceDurchschnittspreisproeinheit",{"$f":"Übersicht!N23","v":0}]
["Monatsangaben.100000000.8.AceDurchschnittspreisproeinheit",{"$f":"Übersicht!O23","v":0}]
["Monatsangaben.100000000.9.AceDurchschnittspreisproeinheit",{"$f":"Übersicht!P23","v":0}]
["Monatsangaben.100000000.2.AceVerbrauchvergleich",{"$f":"Übersicht!I28","v":0}]
["Monatsangaben.100000000.3.AceVerbrauchvergleich",{"$f":"Übersicht!J28","v":0}]
["Monatsangaben.100000000.4.AceVerbrauchvergleich",{"$f":"Übersicht!K28","v":0}]
["Monatsangaben.100000000.5.AceVerbrauchvergleich",{"$f":"Übersicht!L28","v":0}]
["Monatsangaben.100000000.6.AceVerbrauchvergleich",{"$f":"Übersicht!M28","v":0}]
["Monatsangaben.100000000.7.AceVerbrauchvergleich",{"$f":"Übersicht!N28","v":0}]
["Monatsangaben.100000000.8.AceVerbrauchvergleich",{"$f":"Übersicht!O28","v":0}]
["Monatsangaben.100000000.9.AceVerbrauchvergleich",{"$f":"Übersicht!P28","v":0}]
["Monatsangaben.100000000.2.AceVerbrauch",{"$f":"Übersicht!I27","v":0}]
["Monatsangaben.100000000.3.AceVerbrauch",{"$f":"Übersicht!J27","v":0}]
{"$rows_left_out":40}
{"sheet":"Zählpunkte Schritt 1","index":5,"n_rows":5,"n_cols":24,"rows_kept":5,"cut":false,"hidden":true,"merged":[]}
[]
[null,"Zählpunkt",null,null,null,null,null,null,"2021-02-01","2021-03-01","2021-04-01","2021-05-01","2021-06-01","2021-07-01","2021-08-01","2021-09-01"]
[null,"Zählpunktnummer (die letzten vier Stellen)",null,null,null,null,null,null,null,null,null,null,null,null,null,null,"i","Bitte geben Sie nur die letzten vier Stellen Ihrer Zählpunktnummer an.",null,null,null,null,null,{"$f":"H4","v":0}]
[null,"Energieart",null,null,null,null,null,null,null,null,null,null,null,null,null,null,"i","Bitte geben Sie die jeweilige Energieart an."]
[null,{"$f":"IF(H4=\"Erdgas\",\"Erdgasverbrauch in kWh von 1. Februar bis 30. September 2021\",\"Stromverbrauch in kWh von 1. Februar bis 30. September 2021\")","v":"Stromverbrauch in kWh von 1. Februar bis 30. September 2021"},null,null,null,null,null,{"$f":"SUM(I5:P5)","v":0},null,null,null,null,null,null,null,null,"i","Bitte ergänzen Sie die monatlichen Verbrauchswerte gem. Lastprofilzähler."]

{"sheet":"Zählpunkte Schritt 2","index":6,"n_rows":7,"n_cols":18,"rows_kept":7,"cut":false,"hidden":true,"merged":[]}
[]
[null,"Zählpunkt",null,null,null,null,null,null,"2022-02-01","2022-03-01","2022-04-01","2022-05-01","2022-06-01","2022-07-01","2022-08-01","2022-09-01"]
[null,"Zählpunktnummer (die letzten vier Stellen)",null,null,null,null,null,null,null,null,null,null,null,null,null,null,"i","Bitte geben Sie nur die letzten vier Stellen Ihrer Zählpunktnummer an."]
[null,"Energieart",null,null,null,null,null,{"$f":"IFERROR(VLOOKUP(H3,'1 - Vergleichszeitraum'!H:X,17,FALSE),\"\")","v":0},null,null,null,null,null,null,null,null,"i","Bitte geben Sie die jeweilige Energieart an."]
[null,{"$f":"IF(H4=\"Erdgas\",\"Arbeitspreis pro kWh Erdgas in EUR\",\"Arbeitspreis pro kWh Strom in EUR\")","v":"Arbeitspreis pro kWh Strom in EUR"},null,null,null,null,null,null,null,null,null,null,null,null,null,null,"i",{"$f":"IF(H4=\"Erdgas\",\"Erdgaskosten exkl. Steuern, Abgaben, Netzentgelte, etc.\",\"Stromkosten exkl. Steuern, Abgaben, Netzentgelte, etc.\")","v":"Stromkosten exkl. Steuern, Abgaben, Netzentgelte, etc."}]
[null,{"$f":"IF(H4=\"Erdgas\",\"Erdgasverbrauch in kWh von 1. Februar bis 30. September 2022\",\"Stromverbrauch in kWh von 1. Februar bis 30. September 2022\")","v":"Stromverbrauch in kWh von 1. Februar bis 30. September 2022"},null,null,null,null,null,null,null,{"$f":"IFERROR(IF(#REF!=\"Nein\",VLOOKUP(H3,'1 - Vergleichszeitraum'!H:AA,20,FALSE)/12,\"\"),\"\")","v":""},{"$f":"IFERROR(IF(#REF!=\"Nein\",VLOOKUP(H3,'1 - Vergleichszeitraum'!H:AA,20,FALSE)/12,\"\"),\"\")","v":""},{"$f":"IFERROR(IF(#REF!=\"Nein\",VLOOKUP(H3,'1 - Vergleichszeitraum'!H:AA,20,FALSE)/12,\"\"),\"\")","v":""},{"$f":"IFERROR(IF(#REF!=\"Nein\",VLOOKUP(H3,'1 - Vergleichszeitraum'!H:AA,20,FALSE)/12,\"\"),\"\")","v":""},{"$f":"IFERROR(IF(#REF!=\"Nein\",VLOOKUP(H3,'1 - Vergleichszeitraum'!H:AA,20,FALSE)/12,\"\"),\"\")","v":""},{"$f":"IFERROR(IF(#REF!=\"Nein\",VLOOKUP(H3,'1 - Vergleichszeitraum'!H:AA,20,FALSE)/12,\"\"),\"\")","v":""},{"$f":"IFERROR(IF(#REF!=\"Nein\",VLOOKUP(H3,'1 - Vergleichszeitraum'!H:AA,20,FALSE)/12,\"\"),\"\")","v":""},"i","Bitte ergänzen Sie die monatlichen Verbrauchswerte gem. Lastprofilzähler."]
[null,{"$f":"IF(H4=\"Erdgas\",\"Zwischensumme Erdgas\",IF(H4=\"Strom\",\"Zwischensumme Strom\",\"\"))","v":""},null,null,null,null,null,null,{"$f":"IFERROR(I5*I6/IF($B7=\"Zwischensumme Strom\",'2 - Förderzeitraum'!AG$9,IF($B7=\"Zwischensumme Erdgas\",'2 - Förderzeitraum'!AG$10,\"\")),\"\")","v":""},{"$f":"IFERROR(J5*J6/IF($B7=\"Zwischensumme Strom\",'2 - Förderzeitraum'!AH$9,IF($B7=\"Zwischensumme Erdgas\",'2 - Förderzeitraum'!AH$10,\"\")),\"\")","v":""},{"$f":"IFERROR(K5*K6/IF($B7=\"Zwischensumme Strom\",'2 - Förderzeitraum'!AI$9,IF($B7=\"Zwischensumme Erdgas\",'2 - Förderzeitraum'!AI$10,\"\")),\"\")","v":""},{"$f":"IFERROR(L5*L6/IF($B7=\"Zwischensumme Strom\",'2 - Förderzeitraum'!AJ$9,IF($B7=\"Zwischensumme Erdgas\",'2 - Förderzeitraum'!AJ$10,\"\")),\"\")","v":""},{"$f":"IFERROR(M5*M6/IF($B7=\"Zwischensumme Strom\",'2 - Förderzeitraum'!AK$9,IF($B7=\"Zwischensumme Erdgas\",'2 - Förderzeitraum'!AK$10,\"\")),\"\")","v":""},{"$f":"IFERROR(N5*N6/IF($B7=\"Zwischensumme Strom\",'2 - Förderzeitraum'!AL$9,IF($B7=\"Zwischensumme Erdgas\",'2 - Förderzeitraum'!AL$10,\"\")),\"\")","v":""},{"$f":"IFERROR(O5*O6/IF($B7=\"Zwischensumme Strom\",'2 - Förderzeitraum'!AM$9,IF($B7=\"Zwischensumme Erdgas\",'2 - Förderzeitraum'!AM$10,\"\")),\"\")","v":""},{"$f":"IFERROR(P5*P6/IF($B7=\"Zwischensumme Strom\",'2 - Förderzeitraum'!AN$9,IF($B7=\"Zwischensumme Erdgas\",'2 - Förderzeitraum'!AN$10,\"\")),\"\")","v":""}]

{"sheet":"Liste","index":7,"n_rows":2,"n_cols":2,"rows_kept":2,"cut":false,"hidden":true,"merged":[]}
["Strom","Nein"]
["Erdgas","Ja"]